Target
Hexokinase-4
Ligand
BDBM229602
Substrate
Meas. Tech.
Coupled Enzymatic Assay
pH
7.2±n/a
EC50
1400±n/a nM
Comments
extracted
Citation
 Bhuniya, DDeshpande, AKandalkar, SKobal, BKurhade, SVyavahare, VKaduskar, R Acetamide derivatives as glucokinase activators, their process and medicinal applications US Patent  US9340506 Publication Date 5/17/2016 
Target
Name:
Hexokinase-4
Synonyms:
GCK Glucokinase (GK) HK IV HXK4_HUMAN Hexokinase-D
Type:
Enzyme
Mol. Mass.:
52175.81
Organism:
Homo sapiens (Human)
Description:
P35557
Residue:
465
  
Inhibitor
Name:
BDBM229602
Synonyms:
US9340506, A-1
Type:
Small Organic Molecule
Emp. Form.:
C19H22N2O5S2
Mol. Mass.:
422.518
SMILES:
O=C(Nc1nccs1)C(OC1CCOCC1)c1ccc(cc1)S(=O)(=O)C1CC1
: