Target
Leucine-rich repeat serine/threonine-protein kinase 2 [970-2527]
Ligand
BDBM228657
Substrate
Meas. Tech.
LRRK2 Kinase Assay
pH
7.4±n/a
Temperature
298.15±n/a K
IC50
2e+2± 3e+1 nM
Comments
extracted
Citation
 Ray, SBender, SKang, SLin, RGlicksman, MALiu, M The Parkinson disease-linked LRRK2 protein mutation I2020T stabilizes an active state conformation leading to increased kinase activity. J Biol Chem 289:13042-53 (2014)  
Target
Name:
Leucine-rich repeat serine/threonine-protein kinase 2 [970-2527]
Synonyms:
LRRK2 Leucine-rich repeat kinase 2 (LRRK2 t-WT) PARK8
Type:
Protein
Mol. Mass.:
177317.56
Organism:
Homo sapiens (Human)
Description:
Human LRRK2 variant (970-2527aa)
Residue:
1558
  
Inhibitor
Name:
BDBM228657
Synonyms:
GSK3-XIII
Type:
Small organic molecule
Emp. Form.:
C18H15N5
Mol. Mass.:
301.3452
SMILES:
Cc1cc(Nc2nc(nc3ccccc23)-c2ccccc2)n[nH]1
: