Target
Steroid 17-alpha-hydroxylase/17,20 lyase
Ligand
BDBM158460
Substrate
Meas. Tech.
CYP17-Lyase Assay
pH
7.5±n/a
IC50
3±n/a nM
Comments
extracted
Citation
 Bock, MGGaul, CGummadi, VRSengupta, S 17a-hydroxylase/C17,20-lyase inhibitors US Patent  US9339501 Publication Date 5/17/2016 
Target
Name:
Steroid 17-alpha-hydroxylase/17,20 lyase
Synonyms:
CP17A_RAT Cyp17a1 Cytochrome P450 17A1 Steroid 17-alpha-hydroxylase/17,20 lyase
Type:
Enzyme
Mol. Mass.:
57255.68
Organism:
Rattus norvegicus (Rat)
Description:
P11715
Residue:
507
  
Inhibitor
Name:
BDBM158460
Synonyms:
US9029399, 32A-II | US9339501, 32A-II
Type:
Small organic molecule
Emp. Form.:
C18H15F3N4O
Mol. Mass.:
360.3331
SMILES:
FC(F)(F)c1cc(ccn1)N1[C@H]2C[C@H]2N(C1=O)c1cnccc1C1CC1
: