Target
Transient receptor potential cation channel subfamily V member 4
Ligand
BDBM230246
Substrate
Meas. Tech.
Inhibition Assay
Temperature
310.15±n/a K
Ki
380±n/a nM
IC50
1100±n/a nM
Comments
extracted
Citation
 Yukimasa, A Aromatic heterocyclic derivative having TRPV4-inhibiting activity US Patent  US9340500 Publication Date 5/17/2016 
Target
Name:
Transient receptor potential cation channel subfamily V member 4
Synonyms:
TRPV4 Transient receptor potential cation channel subfamily V member 4 (TRPV4) VROAC
Type:
Enzyme
Mol. Mass.:
98290.10
Organism:
Homo sapiens (Human)
Description:
Q9HBA0
Residue:
871
  
Inhibitor
Name:
BDBM230246
Synonyms:
US9340500, I-090
Type:
Small organic molecule
Emp. Form.:
C22H27F3N2O3
Mol. Mass.:
424.4566
SMILES:
CCOC(=O)CCn1c(C)c(cc1C(C)(C)C)C(=O)Nc1cccc(c1)C(F)(F)F
: