Target
Transient receptor potential cation channel subfamily V member 4
Ligand
BDBM230277
Substrate
Meas. Tech.
Inhibition Assay
Temperature
310.15±n/a K
Ki
450±n/a nM
IC50
1400±n/a nM
Comments
extracted
Citation
 Yukimasa, A Aromatic heterocyclic derivative having TRPV4-inhibiting activity US Patent  US9340500 Publication Date 5/17/2016 
Target
Name:
Transient receptor potential cation channel subfamily V member 4
Synonyms:
TRPV4 Transient receptor potential cation channel subfamily V member 4 (TRPV4) VROAC
Type:
Enzyme
Mol. Mass.:
98290.10
Organism:
Homo sapiens (Human)
Description:
Q9HBA0
Residue:
871
  
Inhibitor
Name:
BDBM230277
Synonyms:
US9340500, I-121
Type:
Small organic molecule
Emp. Form.:
C21H26F5N3O
Mol. Mass.:
431.4427
SMILES:
CNCC(F)(F)Cn1c(C)c(cc1C(C)(C)C)C(=O)Nc1cccc(c1)C(F)(F)F
: