Target
Tyrosine-protein kinase ABL1 [64-515]
Ligand
BDBM230801
Substrate
Meas. Tech.
Caliper Assay
pH
7.5±n/a
Temperature
303.15±n/a K
IC50
0.2±n/a nM
Comments
extracted
Citation
 Furet, PGrotzfeld, RMJahnke, WJones, DBManley, PWMarzinzik, APelle, XFSalem, BSchoepfer, J Benzamide derivatives for inhibiting the activity of ABL1, ABL2 and BCR-ABL1 US Patent  US9340537 Publication Date 5/17/2016 
Target
Name:
Tyrosine-protein kinase ABL1 [64-515]
Synonyms:
ABL ABL1_HUMAN Tyrosine-protein kinase ABL1 Tyrosine-protein kinase ABL1 (ABL) | Tyrosine-protein kinase ABL1 (ABL1)
Type:
Enzyme Catalytic Domain
Mol. Mass.:
51539.77
Organism:
Homo sapiens (Human)
Description:
aa 64-515
Residue:
452
  
Inhibitor
Name:
BDBM230801
Synonyms:
US9340537, 55 | US9896444, Example 55
Type:
Small organic molecule
Emp. Form.:
C21H19ClF2N6O2
Mol. Mass.:
460.864
SMILES:
N[C@H]1[C@@H]2CN(C[C@H]12)c1ncc(cc1-c1ccn[nH]1)C(=O)Nc1ccc(OC(F)(F)Cl)cc1
: