Target
Aldo-keto reductase family 1 member C4
Ligand
BDBM50427621
Substrate
Meas. Tech.
Inhibition Assay
IC50
>100±n/a nM
Citation
 Marnett, LJLiedtke, AJPenning, TMAdeniji, AOByrns, MC Indomethacin analogs for the treatment of castrate-resistant prostate cancer US Patent  US9346803 Publication Date 5/24/2016 
Target
Name:
Aldo-keto reductase family 1 member C4
Synonyms:
3-alpha-HSD1 3-alpha-hydroxysteroid dehydrogenase type I AKR1C4 Aldo-keto reductase family 1 member C4 (AK1C4) CHDR DD-4 Dihydrodiol dehydrogenase 4 | HAKRA
Type:
Enzyme
Mol. Mass.:
37068.40
Organism:
Homo sapiens (Human)
Description:
P17516
Residue:
323
  
Inhibitor
Name:
BDBM50427621
Synonyms:
CHEMBL2323490 | US9346803, 1
Type:
Small organic molecule
Emp. Form.:
C19H14ClF3N2O5S
Mol. Mass.:
474.838
SMILES:
COc1ccc2n(cc(CC(=O)NS(=O)(=O)C(F)(F)F)c2c1)C(=O)c1ccc(Cl)cc1
: