Target
Olfactory receptor class A-like protein 1
Ligand
BDBM231635
Substrate
Meas. Tech.
Functional Calcium Imaging Assay
pH
7.4±n/a
EC50
9.17e+4± 1.73e+4 nM
Comments
extracted
Citation
 Behrens, MFrank, ORawel, HAhuja, GPotting, CHofmann, TMeyerhof, WKorsching, S ORA1, a zebrafish olfactory receptor ancestral to all mammalian V1R genes, recognizes 4-hydroxyphenylacetic acid, a putative reproductive pheromone. J Biol Chem 289:19778-88 (2014)  
Target
Name:
Olfactory receptor class A-like protein 1
Synonyms:
ORA1_DANRE Vlr2 | ora1
Type:
Protein
Mol. Mass.:
34536.30
Organism:
Danio rerio (Zebrafish)
Description:
Q597G5
Residue:
316
  
Inhibitor
Name:
BDBM231635
Synonyms:
4-Aminophenylacetic acid
Type:
Small organic molecule
Emp. Form.:
C8H9NO2
Mol. Mass.:
151.1626
SMILES:
Nc1ccc(CC(O)=O)cc1
: