Target
5-hydroxytryptamine receptor 1A
Ligand
BDBM232200
Substrate
Meas. Tech.
[3H]8-OH-DPAT Binding Assay
pH
7.4±n/a
Temperature
300.15±n/a K
IC50
4.9e+3±n/a nM
Comments
extracted
Citation
 Jung, JCMin, DKim, HJang, SLee, YPark, WKhan, IAMoon, HIJung, MOh, S Design, synthesis, and biological evaluation of 3,4,5-trimethoxyphenyl acrylamides as antinarcotic agents. J Enzyme Inhib Med Chem 25:38-43 (2010)  
Target
Name:
5-hydroxytryptamine receptor 1A
Synonyms:
5-HT-1A 5-hydroxytryptamine receptor 1A (5-HT-1A) ADRB2RL1 Dopamine D2 receptor and serotonin 1a receptor HTR1A | Serotonin receptor 1A
Type:
Mol. Mass.:
46122.49
Organism:
Homo sapiens (Human)
Description:
Residue:
422
  
Inhibitor
Name:
BDBM232200
Synonyms:
(E)-N-Butyl-3-(3,4,5-trimethoxyphenyl) acrylamide (1c)
Type:
Small organic molecule
Emp. Form.:
C16H23NO4
Mol. Mass.:
293.3581
SMILES:
CCCCNC(=O)\C=C\c1cc(OC)c(OC)c(OC)c1
: