Target
5-hydroxytryptamine receptor 7
Ligand
BDBM232203
Substrate
Meas. Tech.
[3H] LSD Binding Assay
pH
7.4±n/a
Temperature
300.15±n/a K
IC50
6.7e+3±n/a nM
Comments
extracted
Citation
 Jung, JCMin, DKim, HJang, SLee, YPark, WKhan, IAMoon, HIJung, MOh, S Design, synthesis, and biological evaluation of 3,4,5-trimethoxyphenyl acrylamides as antinarcotic agents. J Enzyme Inhib Med Chem 25:38-43 (2010)  
Target
Name:
5-hydroxytryptamine receptor 7
Synonyms:
5-HT-7 5-HT7 5-HT7S 5HT7 HTR7 | Serotonin receptor 7
Type:
G Protein-Coupled Receptor (GPCR)
Mol. Mass.:
53573.08
Organism:
Homo sapiens (Human)
Description:
P34969
Residue:
479
  
Inhibitor
Name:
BDBM232203
Synonyms:
(E)-N-Decyl-3-(3,4,5-trimethoxyphenyl) acrylamide (1f)
Type:
Small organic molecule
Emp. Form.:
C22H35NO4
Mol. Mass.:
377.5176
SMILES:
CCCCCCCCCCNC(=O)\C=C\c1cc(OC)c(OC)c(OC)c1
: