Target
3-oxoacyl-[acyl-carrier-protein] synthase 3
Ligand
BDBM233054
Substrate
Meas. Tech.
3D-QSAR
IC50
74900±n/a nM
Citation
 Lu, XChen, YYou, Q 3D-QSAR, molecular docking studies, and binding mode prediction of thiolactomycin analogs as mtFabH inhibitors. J Enzyme Inhib Med Chem 25:240-9 (2010)  
Target
Name:
3-oxoacyl-[acyl-carrier-protein] synthase 3
Synonyms:
β-Ketoacyl-acyl carrier protein (ACP) synthase III (FabH) FABH_MYCTU | fabH
Type:
Enzyme
Mol. Mass.:
34865.07
Organism:
Mycobacterium tuberculosis
Description:
P9WNG3
Residue:
335
  
Inhibitor
Name:
BDBM233054
Synonyms:
Thiolactomycin (TLM, 1)
Type:
Small organic molecule
Emp. Form.:
C11H14O2S
Mol. Mass.:
210.293
SMILES:
C\C(C=C)=C/C1(C)SC(=O)C(C)=C1O
: