Target
Glucose-6-phosphate 1-dehydrogenase
Ligand
BDBM233194
Substrate
Meas. Tech.
In Vitro Inhibition Assay
Ki
5.405e+5± 1.528e+5 nM
IC50
2.230e+6±n/a nM
Citation
 Akkemik, EBudak, HCiftci, M Effects of some drugs on human erythrocyte glucose 6-phosphate dehydrogenase: an in vitro study. J Enzyme Inhib Med Chem 25:871-5 (2010)  
Target
Name:
Glucose-6-phosphate 1-dehydrogenase
Synonyms:
G6PD Glucose 6-phosphate dehydrogenase (G6PD) glucose-6-phosphate 1-dehydrogenase isoform b
Type:
Enzyme
Mol. Mass.:
59258.58
Organism:
Homo sapiens (Human)
Description:
P11413
Residue:
515
  
Inhibitor
Name:
BDBM233194
Synonyms:
Methylprednisolone acetate
Type:
Small organic molecule
Emp. Form.:
C24H32O6
Mol. Mass.:
416.5073
SMILES:
C[C@H]1C[C@H]2[C@@H]3CC[C@](O)(C(=O)COC(C)=O)[C@@]3(C)C[C@H](O)[C@@H]2[C@@]2(C)C=CC(=O)C=C12
: