Target
Serine protease 1
Ligand
BDBM234237
Substrate
Meas. Tech.
Inhibition Assay
pH
8±n/a
Ki
0.24±n/a nM
Comments
extracted
Citation
 Suzuki, TKoshiba, TTokumasu, MOhsumi, K Heterocyclic carboxylic acid ester derivative US Patent  US9346821 Publication Date 5/24/2016 
Target
Name:
Serine protease 1
Synonyms:
Alpha-trypsin chain 1 Beta-trypsin PRSS1 TRP1 TRY1_HUMAN Thrombin & trypsin Trypsin I | Trypsin-1
Type:
Enzyme
Mol. Mass.:
26557.80
Organism:
Homo sapiens (Human)
Description:
P07477
Residue:
247
  
Inhibitor
Name:
BDBM234237
Synonyms:
US9346821, A-5
Type:
Small organic molecule
Emp. Form.:
C21H24N4O9S
Mol. Mass.:
508.502
SMILES:
NC(=N)c1ccc(OC(=O)c2ccc(CN3CCC[C@@H]3C(=O)N[C@@H](CS(O)(=O)=O)C(O)=O)o2)cc1
: