Target
Serine protease 1
Ligand
BDBM234246
Substrate
Meas. Tech.
Inhibition Assay
pH
8±n/a
Ki
0.29±n/a nM
Comments
extracted
Citation
 Suzuki, TKoshiba, TTokumasu, MOhsumi, K Heterocyclic carboxylic acid ester derivative US Patent  US9346821 Publication Date 5/24/2016 
Target
Name:
Serine protease 1
Synonyms:
Alpha-trypsin chain 1 Beta-trypsin PRSS1 TRP1 TRY1_HUMAN Thrombin & trypsin Trypsin I | Trypsin-1
Type:
Enzyme
Mol. Mass.:
26557.80
Organism:
Homo sapiens (Human)
Description:
P07477
Residue:
247
  
Inhibitor
Name:
BDBM234246
Synonyms:
US9346821, B-13
Type:
Small organic molecule
Emp. Form.:
C22H23FN4O7S
Mol. Mass.:
506.504
SMILES:
NC(=N)c1ccc(OC(=O)c2ccc(CN3CCC[C@@H]3C(=O)N[C@@H](CC(O)=O)C(O)=O)s2)c(F)c1
: