Target
3-hydroxy-3-methylglutaryl-coenzyme A reductase
Ligand
BDBM50432559
Substrate
Meas. Tech.
Reductase Activity Assay
pH
7.4±n/a
IC50
9.2±n/a nM
Comments
extracted
Citation
 Lin, JFang, JChern, TChen, JChen, CWei, T 3,5,N-trihydroxy-alkanamide and derivatives: method for making same and use thereof US Patent  US9353061 Publication Date 5/31/2016 
Target
Name:
3-hydroxy-3-methylglutaryl-coenzyme A reductase
Synonyms:
3-hydroxy-3-methylglutaryl-coenzyme A (HMG-CoA) reductase HMDH_HUMAN HMG-CoA reductase (HMGR) | HMGCR
Type:
Enzyme
Mol. Mass.:
97477.10
Organism:
Homo sapiens (Human)
Description:
P04035
Residue:
888
  
Inhibitor
Name:
BDBM50432559
Synonyms:
CHEMBL2347008 | US9353061, Atorva-HA (5)
Type:
Small organic molecule
Emp. Form.:
C33H36FN3O5
Mol. Mass.:
573.6544
SMILES:
CC(C)c1c(C(=O)Nc2ccccc2)c(c(-c2ccc(F)cc2)n1CC[C@@H](O)C[C@@H](O)CC(=O)NO)-c1ccccc1
: