Target
Histone deacetylase 1
Ligand
BDBM19149
Substrate
Meas. Tech.
Fluorescent Activity Assay
Temperature
298.15±n/a K
IC50
20.9±7.1 nM
Comments
extracted
Citation
 Lin, JFang, JChern, TChen, JChen, CWei, T 3,5,N-trihydroxy-alkanamide and derivatives: method for making same and use thereof US Patent  US9353061 Publication Date 5/31/2016 
Target
Name:
Histone deacetylase 1
Synonyms:
Cereblon/Histone deacetylase 1 HDAC1 Histone deacetylase 1 (HDAC1) RPD3L1
Type:
Enzyme
Mol. Mass.:
55090.27
Organism:
Homo sapiens (Human)
Description:
Q13547
Residue:
482
  
Inhibitor
Name:
BDBM19149
Synonyms:
CHEMBL98 SAHA US10188756, Compound SAHA US11505523, Compound SAHA US9353061, SAHA US9695181, Vorinostat Zolinza suberoylanilide hydroxamic acid
Type:
Small organic molecule
Emp. Form.:
C14H20N2O3
Mol. Mass.:
264.3202
SMILES:
ONC(=O)CCCCCCC(=O)Nc1ccccc1
: