Target
N-acylethanolamine-hydrolyzing acid amidase
Ligand
BDBM50439661
Substrate
Meas. Tech.
Enzymatic Assay
pH
7.4±n/a
IC50
390±n/a nM
Comments
extracted
Citation
 Piomelli, DBandiera, TMor, MTarzia, GBertozzi, FPonzano, S Disubstituted beta-lactones as inhibitors of N-acylethanolamine acid amidase (NAAA) US Patent  US9353075 Publication Date 5/31/2016 
Target
Name:
N-acylethanolamine-hydrolyzing acid amidase
Synonyms:
ASAH-like protein N-acylethanolamine acid amidase (NAAA) N-acylethanolamine-hydrolyzing acid amidase (NAAA) N-acylethanolamine-hydrolyzing acid amidase subunit beta NAAA_RAT | Naaa
Type:
Enzyme
Mol. Mass.:
40306.53
Organism:
Rattus norvegicus (Rat)
Description:
Q5KTC7
Residue:
362
  
Inhibitor
Name:
BDBM50439661
Synonyms:
CHEMBL2419822 | US9353075, 5
Type:
Small organic molecule
Emp. Form.:
C15H19NO4
Mol. Mass.:
277.3157
SMILES:
C[C@@H]1OC(=O)[C@@H]1NC(=O)OCCCCc1ccccc1
: