Target
L-lactate dehydrogenase B chain
Ligand
BDBM234446
Substrate
Meas. Tech.
LDH Activity Assay
pH
7.4±n/a
IC50
7000000±n/a nM
Comments
extracted
Citation
 Rodríguez-Páez, LChena-Taboada, MACabrera-Hernández, ACordero-Martínez, JWong, C Oxamic acid analogues as LDH-C4-specific competitive inhibitors. J Enzyme Inhib Med Chem 26:579-86 (2011)  
Target
Name:
L-lactate dehydrogenase B chain
Synonyms:
L-lactate:NAD+ oxidoreductase B (LDH-B4) Ldh-2 Ldhb
Type:
Enzyme
Mol. Mass.:
36569.37
Organism:
Mus musculus (Mouse)
Description:
P16125
Residue:
334
  
Inhibitor
Name:
BDBM234446
Synonyms:
N-Isobutyl oxamate
Type:
Small organic molecule
Emp. Form.:
C6H10NO3
Mol. Mass.:
144.149
SMILES:
CC(C)CNC(=O)C([O-])=O
: