Target
L-lactate dehydrogenase C chain
Ligand
BDBM234443
Substrate
Meas. Tech.
LDH Activity Assay
pH
7.4±n/a
IC50
2000±n/a nM
Comments
extracted
Citation
 Rodríguez-Páez, LChena-Taboada, MACabrera-Hernández, ACordero-Martínez, JWong, C Oxamic acid analogues as LDH-C4-specific competitive inhibitors. J Enzyme Inhib Med Chem 26:579-86 (2011)  
Target
Name:
L-lactate dehydrogenase C chain
Synonyms:
L-lactate:NAD+ oxidoreductase C (LDH-C4) Ldh-3 Ldhc
Type:
Enzyme
Mol. Mass.:
35917.99
Organism:
Mus musculus (Mouse)
Description:
P00342
Residue:
332
  
Inhibitor
Name:
BDBM234443
Synonyms:
N-Ethyl oxamate
Type:
Small organic molecule
Emp. Form.:
C4H6NO3
Mol. Mass.:
116.0959
SMILES:
CCNC(=O)C([O-])=O
: