Target
Platelet-derived growth factor subunit B
Ligand
BDBM234584
Substrate
Meas. Tech.
Kinase Assay
pH
7.4±n/a
IC50
28±n/a nM
Comments
extracted
Citation
 Boral, SMalone, TCWang, S Indole-1-carboxamides as kinase inhibitors US Patent  US9353093 Publication Date 5/31/2016 
Target
Name:
Platelet-derived growth factor subunit B
Synonyms:
PDGF PDGFB Platelet-derived growth factor subunit B SIS
Type:
Enzyme
Mol. Mass.:
27298.80
Organism:
Homo sapiens (Human)
Description:
P01127
Residue:
241
  
Inhibitor
Name:
BDBM234584
Synonyms:
US9353093, 6
Type:
Small organic molecule
Emp. Form.:
C23H17F3N4O2
Mol. Mass.:
438.4019
SMILES:
NC(=O)n1c(cc2ccccc12)-c1ccc(NC(=O)Nc2cccc(c2)C(F)(F)F)cc1
: