Target
Platelet-derived growth factor subunit B
Ligand
BDBM234590
Substrate
Meas. Tech.
Kinase Assay
pH
7.4±n/a
IC50
118±n/a nM
Comments
extracted
Citation
 Boral, SMalone, TCWang, S Indole-1-carboxamides as kinase inhibitors US Patent  US9353093 Publication Date 5/31/2016 
Target
Name:
Platelet-derived growth factor subunit B
Synonyms:
PDGF PDGFB Platelet-derived growth factor subunit B SIS
Type:
Enzyme
Mol. Mass.:
27298.80
Organism:
Homo sapiens (Human)
Description:
P01127
Residue:
241
  
Inhibitor
Name:
BDBM234590
Synonyms:
US9353093, 12
Type:
Small organic molecule
Emp. Form.:
C23H20N4O2
Mol. Mass.:
384.4305
SMILES:
Cc1ccccc1NC(=O)Nc1ccc(cc1)-c1cc2ccccc2n1C(N)=O
: