Target
Isoform PDE10A2 of cAMP and cAMP-inhibited cGMP 3',5'-cyclic phosphodiesterase 10A (PDE10A2)
Ligand
BDBM234715
Substrate
Meas. Tech.
Fluorescence Polarization Assay
Ki
0.001±n/a nM
Citation
 Kuduk, SDMcComas, CCReger, TSQi, C Substituted pyridizinone derivatives as PDE10 inhibitors US Patent  US9353104 Publication Date 5/31/2016 
Target
Name:
Isoform PDE10A2 of cAMP and cAMP-inhibited cGMP 3',5'-cyclic phosphodiesterase 10A (PDE10A2)
Synonyms:
PDE10A Phosphodiesterase 10A Phosphodiesterase 10A2 cAMP and cAMP-inhibited cGMP 3',5'-cyclic phosphodiesterase 10A (PDE10A2)
Type:
Enzyme
Mol. Mass.:
89387.03
Organism:
Homo sapiens (Human)
Description:
Q9Y233-2
Residue:
789
  
Inhibitor
Name:
BDBM234715
Synonyms:
US9353104, 3
Type:
Small organic molecule
Emp. Form.:
C22H22N6O2S
Mol. Mass.:
434.514
SMILES:
Cc1nnc(CNc2cc(OC[C@H]3C[C@@H]3c3ccc4ccccc4n3)nn(C)c2=O)s1
: