Target
Carbonic anhydrase 1
Ligand
BDBM20625
Substrate
Meas. Tech.
CA Enzyme Assay
IC50
9.4e+4±n/a nM
Citation
 Gençer, NErgün, ADemir, D In vitro effects of some anabolic compounds on erythrocyte carbonic anhydrase I and II. J Enzyme Inhib Med Chem 27:208-10 (2012)  
Target
Name:
Carbonic anhydrase 1
Synonyms:
CA-I CAB Carbonate dehydratase I Carbonic anhydrase 1 (CA I) Carbonic anhydrase 1 (Recombinant CA I) Carbonic anhydrase B Carbonic anhydrase I (CA I) Carbonic anhydrase I (CAI) Carbonic anhydrase isoenzyme I (hCA I) | hCA
Type:
Enzyme
Mol. Mass.:
28873.37
Organism:
Homo sapiens (Human)
Description:
P00915
Residue:
261
  
Inhibitor
Name:
BDBM20625
Synonyms:
4-[(3E)-4-(4-hydroxyphenyl)hex-3-en-3-yl]phenol CHEMBL411 Diethylstilbestrol (1) Stilboestroform
Type:
Small organic molecule
Emp. Form.:
C18H20O2
Mol. Mass.:
268.3502
SMILES:
CC\C(=C(\CC)c1ccc(O)cc1)c1ccc(O)cc1
: