Target
Nuclear receptor ROR-gamma
Ligand
BDBM292849
Substrate
Meas. Tech.
transient transactivation assay
IC50
<100±n/a nM
Citation
 Argiriadi, MABreinlinger, ECCusack, KPHobson, ADPotin, DBarth, MAmaudrut, JPoupardin, OMounier, LKort, ME Nuclear receptor modulators US Patent  US10106501 Publication Date 10/23/2018 
Target
Name:
Nuclear receptor ROR-gamma
Synonyms:
NR1F3 Nuclear receptor ROR-gamma (RORC) RAR-related orphan receptor C (RORc) RORG RZRG Retinoid-related orphan receptor-gamma (RORc)
Type:
Enzyme Catalytic Domain
Mol. Mass.:
58218.40
Organism:
Homo sapiens (Human)
Description:
P51449
Residue:
518
  
Inhibitor
Name:
BDBM292849
Synonyms:
US10106501, Example FT
Type:
Small organic molecule
Emp. Form.:
C26H28Cl2F3N3O2
Mol. Mass.:
542.421
SMILES:
COCCC1CCN(CC1)C(=O)c1ccc(Cl)c(Cc2cc3c(C)cc(nc3n2C)C(F)(F)F)c1Cl
: