Target
Apoptosis regulator Bcl-2
Ligand
BDBM237170
Substrate
Meas. Tech.
Time Resolved-Fluorescence Resonance Energy Transfer (TR-FRET) Assay
Temperature
298.15±n/a K
Ki
<0.010±n/a nM
Comments
extracted
Citation
 Tao, ZWang, XSouers, AJCatron, NDSullivan, GM Apoptosis-inducing agents for the treatment of cancer and immune and autoimmune diseases US Patent  US9403822 Publication Date 8/2/2016 
Target
Name:
Apoptosis regulator Bcl-2
Synonyms:
Apoptosis regulator Bcl-2 Protein BCL-2 BCL2_HUMAN | Bcl-2 Protein
Type:
Homodimer or heterodimer
Mol. Mass.:
26269.11
Organism:
Homo sapiens (Human)
Description:
P10415
Residue:
239
  
Inhibitor
Name:
BDBM237170
Synonyms:
US9403822, 3
Type:
Small organic molecule
Emp. Form.:
C46H51ClFN6O12PS
Mol. Mass.:
997.42
SMILES:
CC1(C)CCC(CN2CCN(CC2)c2ccc(C(=O)NS(=O)(=O)c3ccc(OCC4(F)CCOCC4)c(c3)[N+]([O-])=O)c(Oc3cn(COP(O)(O)=O)c4nccc4c3)c2)=C(C1)c1ccc(Cl)cc1
: