Target
Carbonic anhydrase 1
Ligand
BDBM237360
Substrate
Meas. Tech.
CA Enzyme Assay
pH
10±n/a
IC50
3.286e+4±n/a nM
Comments
extracted
Citation
 Karatas, MOAlici, BCakir, UCetinkaya, EDemir, DErgün, AGençer, NArslan, O Synthesis and carbonic anhydrase inhibitory properties of novel coumarin derivatives. J Enzyme Inhib Med Chem 28:299-304 (2013)  
Target
Name:
Carbonic anhydrase 1
Synonyms:
CA-I CAB Carbonate dehydratase I Carbonic anhydrase 1 (CA I) Carbonic anhydrase 1 (Recombinant CA I) Carbonic anhydrase B Carbonic anhydrase I (CA I) Carbonic anhydrase I (CAI) Carbonic anhydrase isoenzyme I (hCA I) | hCA
Type:
Enzyme
Mol. Mass.:
28873.37
Organism:
Homo sapiens (Human)
Description:
P00915
Residue:
261
  
Inhibitor
Name:
BDBM237360
Synonyms:
1-(2-Ethoxyethyl)-3-(4-methyl-7,8-dihydroxy-2H-chromen-2-one)benzimidazolium chloride (3e)
Type:
Small organic molecule
Emp. Form.:
C21H22N2O5
Mol. Mass.:
382.4098
SMILES:
CCOCCN1CN(Cc2cc(=O)oc3c(O)c(O)ccc23)c2ccccc12
: