Target
Carbonic anhydrase 2
Ligand
BDBM237357
Substrate
Meas. Tech.
CA Enzyme Assay
pH
10±n/a
IC50
5.145e+4±n/a nM
Comments
extracted
Citation
 Karatas, MOAlici, BCakir, UCetinkaya, EDemir, DErgün, AGençer, NArslan, O Synthesis and carbonic anhydrase inhibitory properties of novel coumarin derivatives. J Enzyme Inhib Med Chem 28:299-304 (2013)  
Target
Name:
Carbonic anhydrase 2
Synonyms:
CA-II CAC Carbonate dehydratase II Carbonic anhydrase 2 (CA-II) Carbonic anhydrase C Carbonic anhydrase II (CA-II) Carbonic anhydrase II (hCA II) | Carbonic anhydrase isoenzyme II (hCA II)
Type:
Enzyme
Mol. Mass.:
29250.71
Organism:
Homo sapiens (Human)
Description:
P00918
Residue:
260
  
Inhibitor
Name:
BDBM237357
Synonyms:
1-(n-Butyl)-3-(4-methyl-7,8-dihydroxy-2H-chromen-2-one)benzimidazolium chloride (3b)
Type:
Small organic molecule
Emp. Form.:
C21H22N2O4
Mol. Mass.:
366.4104
SMILES:
CCCCN1CN(Cc2cc(=O)oc3c(O)c(O)ccc23)c2ccccc12
: