Target
Carbonic anhydrase 2
Ligand
BDBM10880
Substrate
Meas. Tech.
Hydratase Activity Assay
IC50
2.4e+3±n/a nM
Citation
 Büyükkidan, NBülbül, MKasimogullari, RBüyükkidan, B Synthesis and characterization of metal complexes of heterocyclic sulfonamide as carbonic anhydrase inhibitors. J Enzyme Inhib Med Chem 28:311-5 (2013)  
Target
Name:
Carbonic anhydrase 2
Synonyms:
CA-II CAC Carbonate dehydratase II Carbonic anhydrase 2 (CA-II) Carbonic anhydrase C Carbonic anhydrase II (CA-II) Carbonic anhydrase II (hCA II) | Carbonic anhydrase isoenzyme II (hCA II)
Type:
Enzyme
Mol. Mass.:
29250.71
Organism:
Homo sapiens (Human)
Description:
P00918
Residue:
260
  
Inhibitor
Name:
BDBM10880
Synonyms:
AZA AZM acetazolamide Acetazolamide Acetazolamide (AZA) Acetazolamide, 5 Acetazolamide, AZA CHEMBL20 Sulfonamide, 1 US11278534, Example acetazolamide sulfonamide 1
Type:
Small organic molecule
Emp. Form.:
C4H6N4O3S2
Mol. Mass.:
222.245
SMILES:
CC(=O)Nc1nnc(s1)S(N)(=O)=O
: