Target
Carbonic anhydrase 5A, mitochondrial
Ligand
BDBM239155
Substrate
Meas. Tech.
CA Inhibition Assay
pH
7.5±n/a
Temperature
277.15±n/a K
Ki
8.4e+2±n/a nM
Comments
extracted
Citation
 Bonneau, AMaresca, AWinum, JYSupuran, CT Metronidazole-coumarin conjugates and 3-cyano-7-hydroxy-coumarin act as isoform-selective carbonic anhydrase inhibitors. J Enzyme Inhib Med Chem 28:397-401 (2013)  
Target
Name:
Carbonic anhydrase 5A, mitochondrial
Synonyms:
CA-VA CA5A Carbonate dehydratase VA Carbonic anhydrase 5A (CA VA) Carbonic anhydrase 5A, mitochondrial precursor Carbonic anhydrase VA (CA VA)
Type:
Enzyme
Mol. Mass.:
34755.54
Organism:
Homo sapiens (Human)
Description:
Human (cloned) isozyme
Residue:
305
  
Inhibitor
Name:
BDBM239155
Synonyms:
7-O-[2-(2-methyl-5-nitro-imidazol-1-yl)ethyl]-4-methylcoumarine (1a)
Type:
Small organic molecule
Emp. Form.:
C16H15N3O5
Mol. Mass.:
329.3074
SMILES:
Cc1ncc(n1CCOc1ccc2c(C)cc(=O)oc2c1)[N+]([O-])=O
: