Target
Carbonic anhydrase 5B, mitochondrial
Ligand
BDBM50095994
Substrate
Meas. Tech.
CA Inhibition Assay
pH
7.5±n/a
Temperature
277.15±n/a K
Ki
1.87e+3±n/a nM
Comments
extracted
Citation
 Bonneau, AMaresca, AWinum, JYSupuran, CT Metronidazole-coumarin conjugates and 3-cyano-7-hydroxy-coumarin act as isoform-selective carbonic anhydrase inhibitors. J Enzyme Inhib Med Chem 28:397-401 (2013)  
Target
Name:
Carbonic anhydrase 5B, mitochondrial
Synonyms:
CA-VB CAH5B_HUMAN Carbonic Anhydrase VB Carbonic anhydrase 5B, mitochondrial Carbonic anhydrase V | Carbonic anhydrase VB (CA VB)
Type:
Enzyme
Mol. Mass.:
36440.83
Organism:
Homo sapiens (Human)
Description:
Human (cloned) isozyme
Residue:
317
  
Inhibitor
Name:
BDBM50095994
Synonyms:
3-Cyano-7-hydroxycoumarin (2) CHEMBL150302
Type:
Small organic molecule
Emp. Form.:
C10H5NO3
Mol. Mass.:
187.1516
SMILES:
Oc1ccc2cc(C#N)c(=O)oc2c1
: