Target
Carbonic anhydrase 13
Ligand
BDBM10880
Substrate
Meas. Tech.
CA Inhibition Assay
pH
7.5±n/a
Temperature
277.15±n/a K
Ki
17±n/a nM
Comments
extracted
Citation
 Bonneau, AMaresca, AWinum, JYSupuran, CT Metronidazole-coumarin conjugates and 3-cyano-7-hydroxy-coumarin act as isoform-selective carbonic anhydrase inhibitors. J Enzyme Inhib Med Chem 28:397-401 (2013)  
Target
Name:
Carbonic anhydrase 13
Synonyms:
CA13 Carbonic anhydrase Carbonic anhydrase XIII (CA XIII)
Type:
Enzyme
Mol. Mass.:
29445.78
Organism:
Homo sapiens (Human)
Description:
Q8N1Q1
Residue:
262
  
Inhibitor
Name:
BDBM10880
Synonyms:
AZA AZM acetazolamide Acetazolamide Acetazolamide (AZA) Acetazolamide, 5 Acetazolamide, AZA CHEMBL20 Sulfonamide, 1 US11278534, Example acetazolamide sulfonamide 1
Type:
Small organic molecule
Emp. Form.:
C4H6N4O3S2
Mol. Mass.:
222.245
SMILES:
CC(=O)Nc1nnc(s1)S(N)(=O)=O
: