Target
Angiopoietin-1 receptor [776-1124]
Ligand
BDBM239634
Substrate
Meas. Tech.
Time-Resolved Fluorescence Resonance Energy Transfer (TR-FRET) Assay
pH
7±n/a
Temperature
295.15±n/a K
IC50
980±n/a nM
Comments
extracted
Citation
 Süβmeier, FLobell, MGrünewald, SHärter, MBuchmann, BTelser, JJöriβen, HHeroult, MKahnert, ALustig, KLindner, N Substituted phenylimidazopyrazoles and their use US Patent  US9394309 Publication Date 7/19/2016 
Target
Name:
Angiopoietin-1 receptor [776-1124]
Synonyms:
TEK TIE2_HUMAN VMCM | VMCM1
Type:
Enzyme
Mol. Mass.:
39865.58
Organism:
Homo sapiens (Human)
Description:
amino acids 776-1124
Residue:
349
  
Inhibitor
Name:
BDBM239634
Synonyms:
US9394309, 87
Type:
Small organic molecule
Emp. Form.:
C24H15F5N6OS
Mol. Mass.:
530.473
SMILES:
FS(F)(F)(F)(F)c1cc(cc(c1)C(=O)Nc1cccc(c1)-n1ccn2nc(cc12)-c1cccnc1)C#N
: