Target
Vascular endothelial growth factor receptor 2
Ligand
BDBM6428
Substrate
Biotinylated VEGF-R Peptide Substrate
Meas. Tech.
Kinase Inhibition Assay
IC50
>10000±n/a nM
Citation
 Kuo, GHWang, AEmanuel, SDeangelis, AZhang, RConnolly, PJMurray, WVGruninger, RHSechler, JFuentes-Pesquera, AJohnson, DMiddleton, SAJolliffe, LChen, X Synthesis and discovery of pyrazine-pyridine biheteroaryl as a novel series of potent vascular endothelial growth factor receptor-2 inhibitors. J Med Chem 48:1886-900 (2005)  
Target
Name:
Vascular endothelial growth factor receptor 2
Synonyms:
Fetal liver kinase 1 Kdr VGFR2_RAT
Type:
Receptor Tyrosine Kinase
Mol. Mass.:
150388.56
Organism:
Rattus norvegicus (rat)
Description:
VEGF-R is a fusion protein containing a polyhistidine tag at the N-terminus followed by amino acids 786-1343 of the rat VEGF-R2 kinase domain.
Residue:
1343
  
Inhibitor
Name:
BDBM6428
Synonyms:
3-[(5-{5-[(3-chlorophenyl)amino]pyrazin-2-yl}pyridin-3-yl)amino]propan-1-ol Pyrazine-Pyridine deriv. 20
Type:
Small organic molecule
Emp. Form.:
C18H18ClN5O
Mol. Mass.:
355.821
SMILES:
OCCCNc1cncc(c1)-c1cnc(Nc2cccc(Cl)c2)cn1
:
Substrate
Name:
Biotinylated VEGF-R Peptide Substrate
Synonyms:
Type:
Peptide
Mol. Mass.:
2588.40
Organism:
Description:
Residue:
23