Target
Poly [ADP-ribose] polymerase 2
Ligand
BDBM240704
Substrate
Meas. Tech.
Biochemical Assay
Kd
1030±n/a nM
Citation
 Papeo, GMCirla, AD'Anello, MScolaro, AZuccotto, F 3-phenyl-isoquinolin-1(2H)-one derivatives as PARP-1 inhibitors US Patent  US9422243 Publication Date 8/23/2016 
Target
Name:
Poly [ADP-ribose] polymerase 2
Synonyms:
(ARTD2 or PARP2) ADPRTL2 PARP2_HUMAN Poly [ADP-ribose] polymerase 2 (PARP2)
Type:
Enzyme
Mol. Mass.:
66225.70
Organism:
Homo sapiens (Human)
Description:
Q9UGN5
Residue:
583
  
Inhibitor
Name:
BDBM240704
Synonyms:
US9422243, 1
Type:
Small organic molecule
Emp. Form.:
C17H14BrFN2O2
Mol. Mass.:
377.208
SMILES:
NCCOc1c([nH]c(=O)c2cc(F)ccc12)-c1ccc(Br)cc1
: