Target
Serine/threonine-protein kinase pim-1
Ligand
BDBM50043662
Substrate
Meas. Tech.
Kinase-Glo Assay
Temperature
298.15±n/a K
IC50
17±n/a nM
Comments
extracted
Citation
 Xu, YBrenning, BGKultgen, SGLiu, XSaunders, MHo, K Substituted imidazo[1,2-b]pyridazines as protein kinase inhibitors US Patent  US9416132 Publication Date 8/16/2016 
Target
Name:
Serine/threonine-protein kinase pim-1
Synonyms:
PIM-1 Kinase PIM1_HUMAN Serine/threonine-protein kinase (PIM1) Serine/threonine-protein kinase PIM1 | Serine/threonine-protein kinase pim-1 (PIM1)
Type:
Protein
Mol. Mass.:
35681.82
Organism:
Homo sapiens (Human)
Description:
P11309
Residue:
313
  
Inhibitor
Name:
BDBM50043662
Synonyms:
CHEMBL3355552 US10392392, Example 8-56 US9416132, 8-56
Type:
Small organic molecule
Emp. Form.:
C22H25F3N4O
Mol. Mass.:
418.4553
SMILES:
CC(C)(O)[C@H]1CC[C@@H](CC1)Nc1ccn2ncc(-c3cccc(c3)C(F)(F)F)c2n1
: