Target
Transient receptor potential cation channel subfamily V member 1
Ligand
BDBM245076
Substrate
Meas. Tech.
Functional Assay
Temperature
310.15±n/a K
IC50
5±n/a nM
Comments
extracted
Citation
 Allison, BDBranstetter, BJBreitenbucher, JGHack, MDHawryluk, NALebsack, ADMcClure, KJMerit, JE Tetrahydro-pyrimidoazepines as modulators of TRPV1 US Patent  US9422293 Publication Date 8/23/2016 
Target
Name:
Transient receptor potential cation channel subfamily V member 1
Synonyms:
Capsaicin receptor Osm-9-like TRP channel 1 TRPV1_HUMAN Transient receptor potential cation channel subfamily V member 1 (TRPV1) Transient receptor potential cation channel subfamily V member 1(TRPV1) Vanilloid VR1 Vanilloid receptor 1 Vanilloid receptor 1 (VRI/TRPV1)
Type:
Protein
Mol. Mass.:
94960.75
Organism:
Homo sapiens (Human)
Description:
Q8NER1
Residue:
839
  
Inhibitor
Name:
BDBM245076
Synonyms:
US9422293, 320 | US9738649, Example 320
Type:
Small organic molecule
Emp. Form.:
C32H39F3N6O3S
Mol. Mass.:
644.751
SMILES:
CC(Oc1nc2CCN(CCc2c(Nc2ccc(cc2)S(=O)(=O)N2CCCC2)n1)c1ncccc1C(F)(F)F)C1CCCCC1
: