Target
Transient receptor potential cation channel subfamily V member 1
Ligand
BDBM245110
Substrate
Meas. Tech.
Functional Assay
Temperature
310.15±n/a K
IC50
10±n/a nM
Comments
extracted
Citation
 Allison, BDBranstetter, BJBreitenbucher, JGHack, MDHawryluk, NALebsack, ADMcClure, KJMerit, JE Tetrahydro-pyrimidoazepines as modulators of TRPV1 US Patent  US9422293 Publication Date 8/23/2016 
Target
Name:
Transient receptor potential cation channel subfamily V member 1
Synonyms:
Capsaicin receptor Osm-9-like TRP channel 1 TRPV1_HUMAN Transient receptor potential cation channel subfamily V member 1 (TRPV1) Transient receptor potential cation channel subfamily V member 1(TRPV1) Vanilloid VR1 Vanilloid receptor 1 Vanilloid receptor 1 (VRI/TRPV1)
Type:
Protein
Mol. Mass.:
94960.75
Organism:
Homo sapiens (Human)
Description:
Q8NER1
Residue:
839
  
Inhibitor
Name:
BDBM245110
Synonyms:
US9422293, 354 | US9738649, Example 354
Type:
Small organic molecule
Emp. Form.:
C27H27F6N5S
Mol. Mass.:
567.592
SMILES:
FC(F)(F)c1ccc(Nc2nc(SC3CCCCC3)nc3CCN(CCc23)c2ncccc2C(F)(F)F)cc1
: