Target
Cytochrome b-245 heavy chain
Ligand
BDBM244059
Substrate
Meas. Tech.
Activity Assay
IC50
1000000000±n/a nM
Citation
 Ganesh, TSun, ASmith, SMLambeth, JD Piperazine derivatives, compositions, and uses related thereto US Patent  US9428478 Publication Date 8/30/2016 
Target
Name:
Cytochrome b-245 heavy chain
Synonyms:
CGD91-phox CYBB Cytochrome b-245, beta polypeptide [Homo sapiens] Heme-binding membrane glycoprotein gp91phox NADPH oxidase 2 (NOX2) Neutrophil cytochrome b 91 kDa polypeptide gp91-1 p22 phagocyte B-cytochrome
Type:
Enzyme
Mol. Mass.:
65355.82
Organism:
Homo sapiens (Human)
Description:
P04839
Residue:
570
  
Inhibitor
Name:
BDBM244059
Synonyms:
US9428478, TG6-167-2
Type:
Small organic molecule
Emp. Form.:
C19H22FN3O2
Mol. Mass.:
343.3953
SMILES:
COc1ccc(cc1)N1CCN(CC1)C(=O)CNc1cccc(F)c1
: