Target
Cytochrome b-245 heavy chain
Ligand
BDBM244061
Substrate
Meas. Tech.
Activity Assay
IC50
200000000±n/a nM
Citation
 Ganesh, TSun, ASmith, SMLambeth, JD Piperazine derivatives, compositions, and uses related thereto US Patent  US9428478 Publication Date 8/30/2016 
Target
Name:
Cytochrome b-245 heavy chain
Synonyms:
CGD91-phox CYBB Cytochrome b-245, beta polypeptide [Homo sapiens] Heme-binding membrane glycoprotein gp91phox NADPH oxidase 2 (NOX2) Neutrophil cytochrome b 91 kDa polypeptide gp91-1 p22 phagocyte B-cytochrome
Type:
Enzyme
Mol. Mass.:
65355.82
Organism:
Homo sapiens (Human)
Description:
P04839
Residue:
570
  
Inhibitor
Name:
BDBM244061
Synonyms:
US9428478, TG6-144-2
Type:
Small organic molecule
Emp. Form.:
C20H24N4O2
Mol. Mass.:
352.4302
SMILES:
CC(=O)c1ccc(NCC(=O)N2CCN(CC2)c2ccc(N)cc2)cc1
: