Target
Xanthine dehydrogenase/oxidase
Ligand
BDBM244061
Substrate
Meas. Tech.
Control Assay
IC50
200000000±n/a nM
Citation
 Ganesh, TSun, ASmith, SMLambeth, JD Piperazine derivatives, compositions, and uses related thereto US Patent  US9428478 Publication Date 8/30/2016 
Target
Name:
Xanthine dehydrogenase/oxidase
Synonyms:
XD XDHA XO Xanthine dehydrogenase/oxidase | Xanthine oxidase
Type:
Enzyme
Mol. Mass.:
146441.21
Organism:
Homo sapiens (Human)
Description:
P47989
Residue:
1333
  
Inhibitor
Name:
BDBM244061
Synonyms:
US9428478, TG6-144-2
Type:
Small organic molecule
Emp. Form.:
C20H24N4O2
Mol. Mass.:
352.4302
SMILES:
CC(=O)c1ccc(NCC(=O)N2CCN(CC2)c2ccc(N)cc2)cc1
: