Target
Coagulation factor X
Ligand
BDBM294039
Substrate
Meas. Tech.
Rat Coagulation Factor Xa Assay
pH
8.3±n/a
Ki
2.87±n/a nM
Comments
extracted
Citation
 Chen, SDing, ZGong, GYan, XHuang, WGuo, FDuan, BGao, RZhou, PLu, XDong, G Preparation method for benzoxazoleoxazine ketone compound and intermediate and crystal form thereof US Patent  US10106557 Publication Date 10/23/2018 
Target
Name:
Coagulation factor X
Synonyms:
Coagulation factor X precursor FA10_RAT Stuart factor
Type:
Enzyme
Mol. Mass.:
54255.03
Organism:
Rattus norvegicus (rat)
Description:
Residue:
482
  
Inhibitor
Name:
BDBM294039
Synonyms:
Process 1 | US10106557, Compound 1
Type:
Small organic molecule
Emp. Form.:
C18H18N2O5
Mol. Mass.:
342.3459
SMILES:
Oc1cc(ccc1NC(=O)OCc1ccccc1)N1CCOCC1=O
: