Target
5'-AMP-activated protein kinase catalytic subunit alpha-2
Ligand
BDBM244230
Substrate
Meas. Tech.
Activation Assay
Temperature
310.15±n/a K
EC50
5.2±n/a nM
Comments
extracted
Citation
 Ohnuki, KAzami, HSawada, YShin, TKuramoto, KKikuchi, SSaito, THamaguchi, HNagashima, T Bicyclic nitrogen-containing aromatic heterocyclic amide compound US Patent  US9428501 Publication Date 8/30/2016 
Target
Name:
5'-AMP-activated protein kinase catalytic subunit alpha-2
Synonyms:
AAPK2_HUMAN AMP-activated protein kinase, alpha-2 subunit AMPK subunit alpha-2 AMPK2 Hydroxymethylglutaryl-CoA reductase kinase | PRKAA2
Type:
Enzyme
Mol. Mass.:
62331.02
Organism:
Homo sapiens (Human)
Description:
P54646
Residue:
552
  
Inhibitor
Name:
BDBM244230
Synonyms:
US9428501, 44
Type:
Small organic molecule
Emp. Form.:
C33H37F3N6O2
Mol. Mass.:
606.6811
SMILES:
COc1ccc(CN2CCC(CC2)c2cc3cc(C(=O)N4CCN(Cc5ccc(cc5)C(F)(F)F)CC4)n(C)c3cn2)cn1
: