Target
Inhibitor of nuclear factor kappa-B kinase subunit epsilon
Ligand
BDBM246053
Substrate
Meas. Tech.
Time-Resolved Fluorescence-based Lanthascreen Assay
pH
7.5±n/a
IC50
<30±n/a nM
Comments
extracted
Citation
 Newton, GKStewart, MRPerrior, TRCrosby, SRHopkins, ANegoita-Giras, GJenkins, K Pyrimidine compounds useful in the treatment of diseases mediated by IKKE and/or TBK1 mechanisms US Patent  US9433622 Publication Date 9/6/2016 
Target
Name:
Inhibitor of nuclear factor kappa-B kinase subunit epsilon
Synonyms:
I kappa-B kinase epsilon I-kappa-B kinase epsilon (IKK-E) IKBKE IKK-epsilon IKKE IKKI KIAA0151 | von Hippel-Lindau disease tumor suppressor/Inhibitor of nuclear factor kappa-B kinase subunit epsilon
Type:
Serine/threonine-protein kinase
Mol. Mass.:
80475.98
Organism:
Homo sapiens (Human)
Description:
Kinase inhibitory activity was determined using recombinant human IKK-epsilon expressed in baculovirus as a FLAG-tagged fusion protein.
Residue:
716
  
Inhibitor
Name:
BDBM246053
Synonyms:
US9433622, DMX- 129
Type:
Small organic molecule
Emp. Form.:
C19H17FN8
Mol. Mass.:
376.3903
SMILES:
Nc1ccc(Nc2nccc(n2)-c2cnc(N3CC[C@H](F)C3)c(c2)C#N)cn1
: