Target
Cytochrome P450 11B2, mitochondrial
Ligand
BDBM249238
Substrate
Meas. Tech.
G402-Based Assay
EC50
5±n/a nM
Citation
 Aebi, JAmrein, KHornsperger, BKuhn, BMaerki, HPMayweg, AVTan, X Dihydroquinoline-2-one derivatives US Patent  US9458135 Publication Date 10/4/2016 
Target
Name:
Cytochrome P450 11B2, mitochondrial
Synonyms:
Aldosterone Synthase (CYP11B2) Aldosterone-synthesizing enzyme CYP11B2 Cytochrome P450 11B2 Cytochrome P450 11B2, mitochondrial P-450C18 | Steroid 18-hydroxylase
Type:
Protein
Mol. Mass.:
57582.15
Organism:
Homo sapiens (Human)
Description:
P19099
Residue:
503
  
Inhibitor
Name:
BDBM249238
Synonyms:
US9458135, 26
Type:
Small organic molecule
Emp. Form.:
C22H19F2N3O2
Mol. Mass.:
395.402
SMILES:
CN1C(=O)CCc2cc(c(F)cc12)-c1cncc(COc2ncccc2F)c1C
: