Target
Cytochrome P450 11B1, mitochondrial
Ligand
BDBM249217
Substrate
Meas. Tech.
G402-Based Assay
EC50
1.7±n/a nM
Citation
 Aebi, JAmrein, KHornsperger, BKuhn, BMaerki, HPMayweg, AVTan, X Dihydroquinoline-2-one derivatives US Patent  US9458135 Publication Date 10/4/2016 
Target
Name:
Cytochrome P450 11B1, mitochondrial
Synonyms:
C11B1_HUMAN CYPXIB1 Cytochrome P450 11B1 Cytochrome P450 11B1, mitochondrial | S11BH
Type:
Enzyme
Mol. Mass.:
57591.44
Organism:
Homo sapiens (Human)
Description:
P15538
Residue:
503
  
Inhibitor
Name:
BDBM249217
Synonyms:
US9458135, 5
Type:
Small organic molecule
Emp. Form.:
C22H21N3O2
Mol. Mass.:
359.421
SMILES:
CN1C(=O)CCc2cc(ccc12)-c1cncc(COc2cc(C)ccn2)c1
: