Target
5-hydroxytryptamine receptor 2B
Ligand
BDBM249360
Substrate
Meas. Tech.
Radiolabel Binding Assay
pH
7.4±n/a
IC50
190±n/a nM
Comments
extracted
Citation
 Canney, DJBhandare, RRBlass, BEAbou-Gharbia, M Disubstituted oxazolidin-2-ones 5-hydroxytryptamine receptor 2B activity modulators US Patent  US9464062 Publication Date 10/11/2016 
Target
Name:
5-hydroxytryptamine receptor 2B
Synonyms:
5-HT-2B 5-hydroxytryptamine (serotonin) receptor 2B [Homo sapiens] 5-hydroxytryptamine receptor 2C (5HT2C) HTR2B Serotonin 2b (5-HT2b) receptor | Serotonin Receptor 2B
Type:
G Protein-Coupled Receptor (GPCR)
Mol. Mass.:
54312.47
Organism:
Homo sapiens (Human)
Description:
Receptor binding assays were performed using human clone stably expressed in CHO cells.
Residue:
481
  
Inhibitor
Name:
BDBM249360
Synonyms:
US9464062, 4
Type:
Small organic molecule
Emp. Form.:
C25H31N3O2
Mol. Mass.:
405.5325
SMILES:
O=C1OC(CN2CCN(CC2)C(c2ccccc2)c2ccccc2)CN1C1CCC1
: