Target
Hematopoietic prostaglandin D synthase
Ligand
BDBM250507
Substrate
Meas. Tech.
Enzyme Immunoassay (EIA) Assay
pH
7.4±n/a
IC50
11±n/a nM
Comments
extracted
Citation
 Vandeusen, CLWeiberth, FJGill, HSLee, GHillegass, A Phenyloxadiazole derivatives as PGDS inhibitors US Patent  US9469627 Publication Date 10/18/2016 
Target
Name:
Hematopoietic prostaglandin D synthase
Synonyms:
GSTS Glutathione-requiring prostaglandin D synthase HPGDS Hematopoietic prostaglandin D synthase Hematopoietic prostaglandin D synthase (HPGDS) PTGDS2 Prostaglandin D Synthase
Type:
Enzyme
Mol. Mass.:
23341.07
Organism:
Homo sapiens (Human)
Description:
The protein was expressed in E. coli strain BL21(DE3) with an N-terminal 6-His tag.
Residue:
199
  
Inhibitor
Name:
BDBM250507
Synonyms:
US9469627, 2
Type:
Small organic molecule
Emp. Form.:
C23H22N6O3
Mol. Mass.:
430.4592
SMILES:
C[C@H](NC(=O)c1cnc(nc1)-c1ccccn1)c1cccc(c1)-c1noc(n1)C(C)(C)O
: