Target
Carbonic anhydrase 2
Ligand
BDBM26980
Substrate
Meas. Tech.
ChEMBL_158305 (CHEMBL763190)
pH
7.5±n/a
Temperature
293.15±n/a K
Ki
63000000±n/a nM
Citation
 Del Prete, SVullo, DDe Luca, VCarginale, Vdi Fonzo, POsman, SMAlOthman, ZSupuran, CTCapasso, C Anion inhibition profiles of a-, ß- and ¿-carbonic anhydrases from the pathogenic bacterium Vibrio cholerae. Bioorg Med Chem 24:3413-7 (2016)  
Target
Name:
Carbonic anhydrase 2
Synonyms:
CA-II CAC Carbonate dehydratase II Carbonic anhydrase 2 (CA-II) Carbonic anhydrase C Carbonic anhydrase II (CA-II) Carbonic anhydrase II (hCA II) | Carbonic anhydrase isoenzyme II (hCA II)
Type:
Enzyme
Mol. Mass.:
29250.71
Organism:
Homo sapiens (Human)
Description:
P00918
Residue:
260
  
Inhibitor
Name:
BDBM26980
Synonyms:
Br- CHEMBL1644694 bromide ion
Type:
Ion
Emp. Form.:
Br
Mol. Mass.:
79.905
SMILES:
[Br-]
: