Target
Alpha-carbonic anhydrase
Ligand
BDBM50333131
Substrate
Meas. Tech.
ChEMBL_158306 (CHEMBL763191)
pH
7.5±n/a
Temperature
293.15±n/a K
Ki
270000±n/a nM
Citation
 Del Prete, SVullo, DDe Luca, VCarginale, Vdi Fonzo, POsman, SMAlOthman, ZSupuran, CTCapasso, C Anion inhibition profiles of a-, ß- and ¿-carbonic anhydrases from the pathogenic bacterium Vibrio cholerae. Bioorg Med Chem 24:3413-7 (2016)  
Target
Name:
Alpha-carbonic anhydrase
Synonyms:
hpαCA
Type:
Protein
Mol. Mass.:
28337.60
Organism:
Helicobacter pylori (strain G27)
Description:
B5Z8I0
Residue:
247
  
Inhibitor
Name:
BDBM50333131
Synonyms:
CHEMBL1075630 tetrasodium {[dioxido(oxo)vanadio]oxy}(oxo)vanadiumbis(olate)
Type:
Small organic molecule
Emp. Form.:
O7V2
Mol. Mass.:
213.881
SMILES:
[O-][V]([O-])(=O)O[V]([O-])([O-])=O
: