Target
Neutrophil elastase
Ligand
BDBM252420
Substrate
US9458113, MeOSuc-AAPV-AMC
Meas. Tech.
Human Neutrophil Elastase Assay
pH
7.5±n/a
Temperature
298.15±n/a K
IC50
10.1±n/a nM
Comments
extracted
Citation
 Peters, SAnderskewitz, RGnamm, CHoesch, HMorschhaeuser, GOost, TRies, UJ Substituted bicyclic dihydropyrimidinones and their use as inhibitors of neutrophil elastase activity US Patent  US9458113 Publication Date 10/4/2016 
Target
Name:
Neutrophil elastase
Synonyms:
Bone marrow serine protease Coagulation factor X ELANE Elastase HLE Leukocyte elastase Medullasin Neutrophil elastase (HNE) PMN elastase Trypsin
Type:
Enzyme
Mol. Mass.:
28532.38
Organism:
Homo sapiens (Human)
Description:
P08246
Residue:
267
  
Inhibitor
Name:
BDBM252420
Synonyms:
US9458113, 19
Type:
Small organic molecule
Emp. Form.:
C25H16F3N3O3
Mol. Mass.:
463.408
SMILES:
FC(F)(F)c1cccc(c1)N1C2=C(C(NC1=O)c1ccc(cc1-c1ccoc1)C#N)C(=O)CC2
:
Substrate
Name:
BDBM211682
Synonyms:
US9290457, MeOSuc-AAPV-AMC
Type:
Substrate
Emp. Form.:
C31H41N5O9
Mol. Mass.:
627.6853
SMILES:
COC(=O)CCC(=O)NC(C)C(=O)NC(C)C(=O)N1CCCC1C(=O)NC(C(C)C)C(=O)Nc1ccc2c(C)cc(=O)oc2c1
: